Reaction Details
TargetAcetyl-CoA carboxylase 2
LigandBDBM50462049
Substrate/Competitorn/a
Meas. Tech.ChEMBL_1772531 (CHEMBL4224643)
IC50 1.9±n/a nM
Citation Nishiura, YMatsumura, AKobayashi, NShimazaki, ASakamoto, SKitade, NTonomura, YIno, AOkuno, T Discovery of a novel olefin derivative as a highly potent and selective acetyl-CoA carboxylase 2 inhibitor with in vivo efficacy. Bioorg Med Chem Lett28:2498-2503 (2018) 
 
Acetyl-CoA carboxylase 2
Name:Acetyl-CoA carboxylase 2
Type:Protein
Mol. Mass.:276535.21
Organism:Homo sapiens (Human)
Description:O00763
Residue:2458
BDBM50462049
NameBDBM50462049
Synonyms:CHEMBL4225405
TypeSmall organic molecule
Emp. Form.C20H20ClN3O3S
Mol. Mass.417.909
SMILESCCOc1nc2ccc(Oc3ccc(\C=C\[C@H](C)NC(C)=O)cn3)c(Cl)c2s1