Reaction Details
TargetGag-Pol polyprotein [489-587,G537V,H558K,V571A]
LigandBDBM50067593
Substrate/Competitorn/a
Meas. Tech.ChEMBL_1772762 (CHEMBL4229754)
Ki 0.380000±n/a nM
Citation Ramesh, RReddy, DS Quest for Novel Chemical Entities through Incorporation of Silicon in Drug Scaffolds. J Med Chem61:3779-3798 (2018) 
 
Gag-Pol polyprotein [489-587,G537V,H558K,V571A]
Name:Gag-Pol polyprotein [489-587,G537V,H558K,V571A]
Type:Protein
Mol. Mass.:10827.77
Organism:Human immunodeficiency virus
Description:P12497[489-587,G537V,H558K,V571A]
Residue:99
BDBM50067593
NameBDBM50067593
Synonyms:CHEBI:44032 Indinavir MK-639 | US10806794, Compound Indinavir
TypeSmall organic molecule
Emp. Form.C36H47N5O4
Mol. Mass.613.7895
SMILESCC(C)(C)NC(=O)[C@@H]1CN(Cc2cccnc2)CCN1C[C@@H](O)C[C@@H](Cc1ccccc1)C(=O)N[C@@H]1[C@H](O)Cc2ccccc12