Reaction Details
TargetProthrombin
LigandBDBM50147818
Substrate/Competitorn/a
Meas. Tech.ChEMBL_1772801 (CHEMBL4229793)
Ki 0.001±n/a nM
Citation Fischer, PM Design of Small-Molecule Active-Site Inhibitors of the S1A Family Proteases as Procoagulant and Anticoagulant Drugs. J Med Chem61:3799-3822 (2018) 
 
Prothrombin
Name:Prothrombin
Type:Protein
Mol. Mass.:70029.57
Organism:Homo sapiens (Human)
Description:P00734
Residue:622
BDBM50147818
NameBDBM50147818
Synonyms:(2-[6-CHLORO-3-{[2,2-DIFLUORO-2-(1-OXIDOPYRIDIN-2-YL)ETHYL]AMINO}-2-OXOPYRAZIN-1(2H)-YL]-N-[5-CHLORO-2-(1H-TETRAZOL-1-YL)BENZYL]ACETAMIDE CHEMBL103461
TypeSmall organic molecule
Emp. Form.C21H17Cl2F2N9O3
Mol. Mass.552.321
SMILES[O-][n+]1ccccc1C(F)(F)CNc1ncc(Cl)n(CC(=O)NCc2cc(Cl)ccc2-n2cnnn2)c1=O