Reaction Details
TargetDipeptidyl peptidase 4
LigandBDBM23926
Substrate/Competitorn/a
Meas. Tech.ChEMBL_1775381 (CHEMBL4232373)
IC50 0.600000±n/a nM
Citation Li, NWang, LJJiang, BLi, XQGuo, CLGuo, SJShi, DY Recent progress of the development of dipeptidyl peptidase-4 inhibitors for the treatment of type 2 diabetes mellitus. Eur J Med Chem151:145-157 (2018) 
 
Dipeptidyl peptidase 4
Name:Dipeptidyl peptidase 4
Type:Enzyme
Mol. Mass.:88271.01
Organism:Homo sapiens (Human)
Description:P27487
Residue:766
BDBM23926
NameBDBM23926
Synonyms:(E)-resveratrol CHEMBL165 Stilbene, 2f cid_445154 trans-resveratrol
TypeSmall organic molecule
Emp. Form.C14H12O3
Mol. Mass.228.2433
SMILESOc1ccc(\C=C\c2cc(O)cc(O)c2)cc1