Reaction Details
TargetChymotrypsinogen B
LigandBDBM50024092
Substrate/Competitorn/a
Meas. Tech.ChEMBL_216620 (CHEMBL819192)
Ki 5.3±n/a nM
Citation Sofia, MJKatzenellenbogen, JA Enol lactone inhibitors of serine proteases. The effect of regiochemistry on the inactivation behavior of phenyl-substituted (halomethylene)tetra- and -dihydrofuranones and (halomethylene)tetrahydropyranones toward alpha-chymotrypsin: stable acyl enzyme intermediate. J Med Chem29:230-8 (1986) Chymotrypsinogen B
Name:Chymotrypsinogen B
Type:PROTEIN
Mol. Mass.:27713.98
Organism:Homo sapiens (Human)
Description:ChEMBL_10909
Residue:263
BDBM50024092
NameBDBM50024092
Synonyms:6-Iodomethylene-4-phenyl-tetrahydro-pyran-2-one | CHEMBL307448
TypeSmall organic molecule
Emp. Form.C12H11IO2
Mol. Mass.314.119
SMILESI\C=C1/CC(CC(=O)O1)c1ccccc1