Reaction Details
TargetSerine/threonine-protein kinase mTOR
LigandBDBM50348452
Substrate/Competitorn/a
Meas. Tech.ChEMBL_1776150 (CHEMBL4233142)
IC50 8.0±n/a nM
Citation Liu, YXia, QFang, L Design and synthesis of alkyl substituted pyridino[2,3-D]pyrimidine compounds as PI3K?/mTOR dual inhibitors with improved pharmacokinetic properties and potent in vivo antitumor activity. Bioorg Med Chem26:3992-4000 (2018) 
 
Serine/threonine-protein kinase mTOR
Name:Serine/threonine-protein kinase mTOR
Type:Rapamycin target protein
Mol. Mass.:288917.12
Organism:Homo sapiens (Human)
Description:P42345
Residue:2549
BDBM50348452
NameBDBM50348452
Synonyms:AZD-8055 US9102670, 1a
TypeSmall organic molecule
Emp. Form.C25H31N5O4
Mol. Mass.465.5447
SMILESCOc1ccc(cc1CO)-c1ccc2c(nc(nc2n1)N1CCOC[C@@H]1C)N1CCOC[C@@H]1C