Reaction Details
TargetMyc proto-oncogene protein
LigandBDBM50463125
Substrate/Competitorn/a
Meas. Tech.ChEMBL_1777746 (CHEMBL4234738)
IC50>100000±n/a nM
Citation Jacob, NTMiranda, POShirey, RJGautam, RZhou, Bde Orbe Izquierdo, MEHixon, MSHart, JRUeno, LVogt, PKJanda, KD Synthetic molecules for disruption of the MYC protein-protein interface. Bioorg Med Chem26:4234-4239 (2018) 
 
Myc proto-oncogene protein
Name:Myc proto-oncogene protein
Type:PROTEIN
Mol. Mass.:48794.95
Organism:Homo sapiens (Human)
Description:ChEMBL_935266
Residue:439
BDBM50463125
NameBDBM50463125
Synonyms:CHEMBL4242611
TypeSmall organic molecule
Emp. Form.C23H15N5O2
Mol. Mass.393.3975
SMILESNC(=O)c1ccc(cc1)-c1cc(nc(n1)-c1cc[n+]([O-])cc1)-c1ccc(cc1)C#N