Reaction Details
TargetMyc proto-oncogene protein
LigandBDBM50463131
Substrate/Competitorn/a
Meas. Tech.ChEMBL_1777746 (CHEMBL4234738)
IC50 7000±n/a nM
Citation Jacob, NTMiranda, POShirey, RJGautam, RZhou, Bde Orbe Izquierdo, MEHixon, MSHart, JRUeno, LVogt, PKJanda, KD Synthetic molecules for disruption of the MYC protein-protein interface. Bioorg Med Chem26:4234-4239 (2018) 
 
Myc proto-oncogene protein
Name:Myc proto-oncogene protein
Type:PROTEIN
Mol. Mass.:48794.95
Organism:Homo sapiens (Human)
Description:ChEMBL_935266
Residue:439
BDBM50463131
NameBDBM50463131
Synonyms:CHEMBL4248559
TypeSmall organic molecule
Emp. Form.C22H14N4O2
Mol. Mass.366.3722
SMILESNC(=O)c1ccc(cc1)-c1cc(nc(n1)-c1ccco1)-c1ccc(cc1)C#N