Reaction Details
TargetMyc proto-oncogene protein
LigandBDBM50463134
Substrate/Competitorn/a
Meas. Tech.ChEMBL_1777746 (CHEMBL4234738)
IC50 10000±n/a nM
Citation Jacob, NTMiranda, POShirey, RJGautam, RZhou, Bde Orbe Izquierdo, MEHixon, MSHart, JRUeno, LVogt, PKJanda, KD Synthetic molecules for disruption of the MYC protein-protein interface. Bioorg Med Chem26:4234-4239 (2018) 
 
Myc proto-oncogene protein
Name:Myc proto-oncogene protein
Type:PROTEIN
Mol. Mass.:48794.95
Organism:Homo sapiens (Human)
Description:ChEMBL_935266
Residue:439
BDBM50463134
NameBDBM50463134
Synonyms:CHEMBL4246868
TypeSmall organic molecule
Emp. Form.C24H17N3O4S
Mol. Mass.443.474
SMILESCS(=O)(=O)NC(=O)c1ccc(cc1)-c1cc(nc(c1)-c1ccc(cc1)C#N)-c1ccco1