Reaction Details
TargetcGMP-dependent 3',5'-cyclic phosphodiesterase
LigandBDBM15296
Substrate/Competitorn/a
Meas. Tech.ChEMBL_154260 (CHEMBL765558)
IC50 200000±n/a nM
Citation Sircar, IDuell, BLBristol, JAWeishaar, REEvans, DB Cardiotonic agents. 5. 1,2-Dihydro-5-[4-(1H-imidazol-1-yl)phenyl]-6-methyl-2-oxo-3- pyridinecarbonitriles and related compounds. Synthesis and inotropic activity. J Med Chem30:1023-9 (1987) cGMP-dependent 3',5'-cyclic phosphodiesterase
Name:cGMP-dependent 3',5'-cyclic phosphodiesterase
Type:Enzyme Catalytic Domain
Mol. Mass.:105691.58
Organism:Homo sapiens (Human)
Description:O00408
Residue:941
BDBM15296
NameBDBM15296
Synonyms:6-methyl-2-oxo-5-(pyridin-4-yl)-1,2-dihydropyridine-3-carbonitrile CHEMBL189 Primacor US9249139, Milrinone
TypeSmall organic molecule
Emp. Form.C12H9N3O
Mol. Mass.211.2194
SMILESCc1[nH]c(=O)c(cc1-c1ccncc1)C#N