Reaction Details
TargetCarnitine O-palmitoyltransferase 1, liver isoform
LigandBDBM50024430
Substrate/Competitorn/a
Meas. Tech.ChEBML_216362
IC50 20±n/a nM
Citation Ho, WTarhan, OKiorpes, TCTutwiler, GFMohrbacher, RJ Resolution of (+/-)-2-tetradecyloxiranecarboxylic acid. Absolute configuration and chiral synthesis of the hypoglycemic R enantiomer and biological activity of enantiomers. J Med Chem30:1094-7 (1987) Carnitine O-palmitoyltransferase 1, liver isoform
Name:Carnitine O-palmitoyltransferase 1, liver isoform
Type:PROTEIN
Mol. Mass.:88147.11
Organism:Rattus norvegicus
Description:ChEMBL_887445
Residue:773
BDBM50024430
NameBDBM50024430
Synonyms:(R) (R) -2-Tetradecyl-oxirane-2-carboxylic acid-Coenzyme A | CHEMBL12070
TypeSmall organic molecule
Emp. Form.C38H66N7O18P3S
Mol. Mass.1033.953
[C@@]1(CO1)C(=O)SCCNC(=O)CCNC(=O)C(O)C(C)(C)COP(O)(=O)OP(O)(=O)OC[C@H]1O[C@H]([C@H](O)[C@@H]1OP(O)(O)=O)n1cnc2c(N)ncnc12