Reaction Details
TargetCarnitine O-palmitoyltransferase 1, liver isoform
LigandBDBM50024432
Substrate/Competitorn/a
Meas. Tech.ChEBML_216362
IC50 30±n/a nM
Citation Ho, WTarhan, OKiorpes, TCTutwiler, GFMohrbacher, RJ Resolution of (+/-)-2-tetradecyloxiranecarboxylic acid. Absolute configuration and chiral synthesis of the hypoglycemic R enantiomer and biological activity of enantiomers. J Med Chem30:1094-7 (1987) Carnitine O-palmitoyltransferase 1, liver isoform
Name:Carnitine O-palmitoyltransferase 1, liver isoform
Type:PROTEIN
Mol. Mass.:88147.11
Organism:Rattus norvegicus
Description:ChEMBL_887445
Residue:773
BDBM50024432
NameBDBM50024432
Synonyms:(R)-(+)2-Tetradecyl-oxirane-2-carboxylic acid | CHEMBL12618
TypeSmall organic molecule
Emp. Form.C17H32O3
Mol. Mass.284.4342
[C@@]1(CO1)C(O)=O