Reaction Details
TargetActivin receptor type-1
LigandBDBM50463510
Substrate/Competitorn/a
Meas. Tech.ChEMBL_1778481 (CHEMBL4235473)
Kd 330±n/a nM
Citation Hudson, LMui, JVázquez, SCarvalho, DMWilliams, EJones, CBullock, ANHoelder, S Novel Quinazolinone Inhibitors of ALK2 Flip between Alternate Binding Modes: Structure-Activity Relationship, Structural Characterization, Kinase Profiling, and Cellular Proof of Concept. J Med Chem61:7261-7272 (2018) 
 
Activin receptor type-1
Name:Activin receptor type-1
Type:n/a
Mol. Mass.:57158.32
Organism:Homo sapiens (Human)
Description:n/a
Residue:509
BDBM50463510
NameBDBM50463510
Synonyms:CHEMBL4244382
TypeSmall organic molecule
Emp. Form.C27H22N4O2
Mol. Mass.434.4892
SMILESO=c1n(cnc2ccc(cc12)-c1ccnc2ccccc12)-c1ccc(cc1)N1CCOCC1