Reaction Details
TargetTrifunctional purine biosynthetic protein adenosine-3
LigandBDBM50024462
Substrate/Competitorn/a
Meas. Tech.ChEBML_70043
Ki 11000±n/a nM
Citation Caperelli, CA N10-substituted 5,8-dideazafolate inhibitors of glycinamide ribonucleotide transformylase. J Med Chem30:1254-6 (1987) Trifunctional purine biosynthetic protein adenosine-3
Name:Trifunctional purine biosynthetic protein adenosine-3
Type:PROTEIN
Mol. Mass.:107504.27
Organism:Mus musculus
Description:ChEMBL_497843
Residue:1010
BDBM50024462
NameBDBM50024462
Synonyms:2-{4-[(2-Amino-4-oxo-3,4-dihydro-quinazolin-6-ylmethyl)-(3-cyano-propyl)-amino]-benzoylamino}-pentanedioic acid | CHEMBL25107
TypeSmall organic molecule
Emp. Form.C25H26N6O6
Mol. Mass.506.5105
SMILESNc1nc2ccc(CN(CCCC#N)c3ccc(cc3)C(=O)NC(CCC(O)=O)C(O)=O)cc2c(=O)[nH]1