Reaction Details
TargetCholinesterase
LigandBDBM50464942
Substrate/Competitorn/a
Meas. Tech.ChEMBL_1783504 (CHEMBL4255021)
IC50 0.250000±n/a nM
Citation Chierrito, TPCPedersoli-Mantoani, SRoca, CSebastian-Pérez, VMartínez-Gonzalez, LPérez, DIPerez, CCanales, ACañada, FJCampillo, NECarvalho, IMartinez, A Chameleon-like behavior of indolylpiperidines in complex with cholinesterases targets: Potent butyrylcholinesterase inhibitors. Eur J Med Chem145:431-444 (2018) 
 
Cholinesterase
Name:Cholinesterase
Type:Homotetramer
Mol. Mass.:68422.27
Organism:Homo sapiens (Human)
Description:P06276
Residue:602
BDBM50464942
NameBDBM50464942
Synonyms:CHEMBL4293015
TypeSmall organic molecule
Emp. Form.C25H31N3O
Mol. Mass.389.5331
SMILESCn1cc(CC(=O)NCCC2CCN(Cc3ccccc3)CC2)c2ccccc12