Reaction Details
TargetCholinesterase
LigandBDBM50464947
Substrate/Competitorn/a
Meas. Tech.ChEMBL_1783504 (CHEMBL4255021)
IC50 1.1±n/a nM
Citation Chierrito, TPCPedersoli-Mantoani, SRoca, CSebastian-Pérez, VMartínez-Gonzalez, LPérez, DIPerez, CCanales, ACañada, FJCampillo, NECarvalho, IMartinez, A Chameleon-like behavior of indolylpiperidines in complex with cholinesterases targets: Potent butyrylcholinesterase inhibitors. Eur J Med Chem145:431-444 (2018) 
 
Cholinesterase
Name:Cholinesterase
Type:Homotetramer
Mol. Mass.:68422.27
Organism:Homo sapiens (Human)
Description:P06276
Residue:602
BDBM50464947
NameBDBM50464947
Synonyms:CHEMBL4277879
TypeSmall organic molecule
Emp. Form.C25H31N3O
Mol. Mass.389.5331
SMILESCc1[nH]c2ccccc2c1CC(=O)NCCC1CCN(Cc2ccccc2)CC1