Reaction Details
TargetCholinesterase
LigandBDBM50187201
Substrate/Competitorn/a
Meas. Tech.ChEMBL_1783504 (CHEMBL4255021)
IC50 0.890000±n/a nM
Citation Chierrito, TPCPedersoli-Mantoani, SRoca, CSebastian-Pérez, VMartínez-Gonzalez, LPérez, DIPerez, CCanales, ACañada, FJCampillo, NECarvalho, IMartinez, A Chameleon-like behavior of indolylpiperidines in complex with cholinesterases targets: Potent butyrylcholinesterase inhibitors. Eur J Med Chem145:431-444 (2018) 
 
Cholinesterase
Name:Cholinesterase
Type:Homotetramer
Mol. Mass.:68422.27
Organism:Homo sapiens (Human)
Description:P06276
Residue:602
BDBM50187201
NameBDBM50187201
Synonyms:CHEMBL3824248
TypeSmall organic molecule
Emp. Form.C25H31N3O
Mol. Mass.389.5331
SMILESO=C(CCc1c[nH]c2ccccc12)NCCC1CCN(Cc2ccccc2)CC1