Reaction Details
TargetThromboxane-A synthase
LigandBDBM7962
Substrate/Competitorn/a
Meas. Tech.ChEBML_213091
IC50 3±n/a nM
Citation Cross, PEDickinson, RPParry, MJRandall, MJ Selective thromboxane synthetase inhibitors. 3. 1H-imidazol-1-yl-substituted benzo[b]furan-, benzo[b]thiophene-, and indole-2- and -3-carboxylic acids. J Med Chem29:1637-43 (1986) Thromboxane-A synthase
Name:Thromboxane-A synthase
Type:Enzyme
Mol. Mass.:60524.67
Organism:Homo sapiens (Human)
Description:P24557
Residue:533
BDBM7962
NameBDBM7962
Synonyms:4-(2-Imidazol-1-yl-ethoxy)-benzoic acid; hydrochloride 4-[2-(1H-imidazol-1-yl)ethoxy]benzoic acid CHEMBL537708 dazoxiben
TypeSmall organic molecule
Emp. Form.C12H12N2O3
Mol. Mass.232.2353
SMILESOC(=O)c1ccc(OCCn2ccnc2)cc1