Reaction Details
TargetSerotonin 2 (5-HT2) receptor
LigandBDBM50025124
Substrate/Competitorn/a
Meas. Tech.ChEMBL_2137 (CHEMBL873482)
IC50 0.562341±n/a nM
Citation Wouters, WJanssen, CGVan Dun, JThijssen, JBLaduron, PM In vitro labeling of serotonin-S2 receptors: synthesis and binding characteristics of [3H]-7-aminoketanserin. J Med Chem29:1663-8 (1986) Serotonin 2 (5-HT2) receptor
Name:Serotonin 2 (5-HT2) receptor
Synonyms:5-hydroxytryptamine receptor 2A/2B/2C
Type:n/a
Mol. Mass.:n/a
Description:ASSAY_ID of ChEMBL is 2197419
Components:This complex has 3 components.
Component 1
Name:5-hydroxytryptamine receptor 2B
Type:Enzyme Catalytic Domain
Mol. Mass.:53668.47
Organism:RAT
Description:5-HT2B HTR2B RAT::P30994
Residue:479
Component 2
Name:5-hydroxytryptamine receptor 2C
Synonyms:5-HT2C 5-hydroxytryptamine receptor 2C (5HT2c) 5ht1c Htr2c Serotonin receptor 2a and 2c (5HT2A and 5HT2C)
Type:Enzyme
Mol. Mass.:51935.10
Organism:Rattus norvegicus (Rat)
Description:P08909
Residue:460
Component 3
Name:5-hydroxytryptamine receptor 2A
Synonyms:5-HT-2A 5-HT2A 5-hydroxytryptamine receptor 2A (5HT2A) Htr2 Serotonin Receptor 2A
Type:G Protein-Coupled Receptor (GPCR)
Mol. Mass.:52852.05
Organism:Rattus norvegicus (rat)
Description:Rat cortex membranes 5-HT2A receptors.
Residue:471
BDBM50025124
NameBDBM50025124
Synonyms:3-{2-[4-(4-Fluoro-benzoyl)-piperidin-1-yl]-ethyl}-7-hydroxy-1H-quinazoline-2,4-dione | CHEMBL46683
TypeSmall organic molecule
Emp. Form.C22H22FN3O4
Mol. Mass.411.4262
SMILESOc1ccc2c(c1)[nH]c(=O)n(CCN1CCC(CC1)C(=O)c1ccc(F)cc1)c2=O