Reaction Details
TargetCD209 antigen
LigandBDBM50466359
Substrate/Competitorn/a
Meas. Tech.ChEMBL_1792830 (CHEMBL4264749)
IC50 3200000±n/a nM
Citation Kiessling, LL Chemistry-driven glycoscience. Bioorg Med Chem26:5229-5238 (2018) 
 
CD209 antigen
Name:CD209 antigen
Type:PROTEIN
Mol. Mass.:45768.84
Organism:Homo sapiens (Human)
Description:ChEMBL_104194
Residue:404
BDBM50466359
NameBDBM50466359
Synonyms:CHEMBL4281743
TypeSmall organic molecule
Emp. Form.C23H33FN2O7S2
Mol. Mass.532.646
SMILESNC(=O)[C@@H](CCC(O)=O)NC(=O)[C@H]1C[C@@H](O)[C@H](O)[C@H](O)[C@H]1SCCCCSCc1cccc(F)c1