Reaction Details
TargetNeuropeptide Y receptor type 5
LigandBDBM50466530
Substrate/Competitorn/a
Meas. Tech.ChEMBL_1793341 (CHEMBL4265260)
EC50 501±n/a nM
Citation Østergaard, SKofoed, JPaulsson, JFMadsen, KGJorgensen, RWulff, BS Design of Y J Med Chem61:10519-10530 (2018) 
 
Neuropeptide Y receptor type 5
Name:Neuropeptide Y receptor type 5
Type:Enzyme
Mol. Mass.:50746.64
Organism:Homo sapiens (Human)
Description:Q15761
Residue:445
BDBM50466530
NameBDBM50466530
Synonyms:CHEMBL4281010
TypeSmall organic molecule
Emp. Form.C102H160N32O26
Mol. Mass.2250.5606
SMILESCC[C@H](C)[C@H](NC(=O)[C@@H]1CCCCNC(=O)CC[C@H](NC(=O)[C@@H](N)Cc2ccc(O)cc2)C(=O)N[C@@H](CO)C(=O)N[C@@H](CCCCN)C(=O)NCCCCCC(=O)N[C@@H](CCCNC(N)=N)C(=O)N[C@@H](Cc2cnc[nH]2)C(=O)N[C@@H](Cc2ccc(O)cc2)C(=O)N[C@@H]([C@@H](C)CC)C(=O)N[C@@H](CC(N)=O)C(=O)N1)C(=O)N[C@@H]([C@@H](C)O)C(=O)N[C@@H](CCCNC(N)=N)C(=O)N[C@@H](CCC(N)=O)C(=O)N[C@@H](CCCNC(N)=N)C(=O)N[C@@H](Cc1ccc(O)cc1)C(O)=O