Reaction Details
TargetNeuropeptide Y receptor type 5
LigandBDBM50466549
Substrate/Competitorn/a
Meas. Tech.ChEMBL_1793341 (CHEMBL4265260)
EC50 794±n/a nM
Citation Østergaard, SKofoed, JPaulsson, JFMadsen, KGJorgensen, RWulff, BS Design of Y J Med Chem61:10519-10530 (2018) 
 
Neuropeptide Y receptor type 5
Name:Neuropeptide Y receptor type 5
Type:Enzyme
Mol. Mass.:50746.64
Organism:Homo sapiens (Human)
Description:Q15761
Residue:445
BDBM50466549
NameBDBM50466549
Synonyms:CHEMBL4282168
TypeSmall organic molecule
Emp. Form.C79H120N26O19
Mol. Mass.1737.9609
SMILESCC(C)C[C@H](NC(=O)[C@H](Cc1ccc(O)cc1)NC(=O)[C@H](Cc1cnc[nH]1)NC(=O)[C@H](CCCNC(N)=N)NC(=O)c1ccccc1N)C(=O)N[C@@H](CC(N)=O)C(=O)N[C@@H](CC(C)C)C(=O)N[C@@H](C(C)C)C(=O)N[C@@H]([C@@H](C)O)C(=O)N[C@@H](CCCNC(N)=N)C(=O)N[C@@H](CCC(N)=O)C(=O)N[C@@H](CCCNC(N)=N)C(=O)N[C@@H](Cc1ccc(O)cc1)C(O)=O