Reaction Details
TargetNeuropeptide Y receptor type 5
LigandBDBM50466563
Substrate/Competitorn/a
Meas. Tech.ChEMBL_1793341 (CHEMBL4265260)
EC50 398±n/a nM
Citation Østergaard, SKofoed, JPaulsson, JFMadsen, KGJorgensen, RWulff, BS Design of Y J Med Chem61:10519-10530 (2018) 
 
Neuropeptide Y receptor type 5
Name:Neuropeptide Y receptor type 5
Type:Enzyme
Mol. Mass.:50746.64
Organism:Homo sapiens (Human)
Description:Q15761
Residue:445
BDBM50466563
NameBDBM50466563
Synonyms:CHEMBL4294418
TypeSmall organic molecule
Emp. Form.C104H164N32O25
Mol. Mass.2262.6144
SMILESCC[C@H](C)[C@@H]1NC(=O)[C@H](CCC(=O)NCCCC[C@H](NC(=O)[C@H](CC(N)=O)NC(=O)[C@H](CC(C)C)NC(=O)[C@H](Cc2ccc(O)cc2)NC(=O)[C@H](Cc2cnc[nH]2)NC(=O)[C@H](CCCNC(N)=N)NC(=O)CCCCCNC(=O)[C@H](CCCCN)NC1=O)C(=O)N[C@@H](C(C)C)C(=O)N[C@@H]([C@@H](C)O)C(=O)N[C@@H](CCCNC(N)=N)C(=O)N[C@@H](CCC(N)=O)C(=O)N[C@@H](CCCNC(N)=N)C(=O)N[C@@H](Cc1ccc(O)cc1)C(O)=O)NC(=O)[C@@H](N)Cc1ccc(O)cc1