Reaction Details
TargetAdenosine receptor A2a
LigandBDBM50014262
Substrate/Competitorn/a
Meas. Tech.ChEBML_27755
Ki 1500±n/a nM
Citation Daly, JWPadgett, WLShamim, MT Analogues of caffeine and theophylline: effect of structural alterations on affinity at adenosine receptors. J Med Chem29:1305-8 (1987) Adenosine receptor A2a
Name:Adenosine receptor A2a
Type:Enzyme Catalytic Domain
Mol. Mass.:44955.08
Organism:GUINEA PIG
Description:ADENOSINE A2 0 GUINEA PIG::P46616
Residue:409
BDBM50014262
NameBDBM50014262
Synonyms:7-Benzyl-1,3-dipropyl-3,7-dihydro-purine-2,6-dione CHEMBL418193
TypeSmall organic molecule
Emp. Form.C18H22N4O2
Mol. Mass.326.3929
SMILESCCCn1c2ncn(Cc3ccccc3)c2c(=O)n(CCC)c1=O