Reaction Details
TargetAdenosine receptor A2a
LigandBDBM50025574
Substrate/Competitorn/a
Meas. Tech.ChEBML_27755
Ki 4000±n/a nM
Citation Daly, JWPadgett, WLShamim, MT Analogues of caffeine and theophylline: effect of structural alterations on affinity at adenosine receptors. J Med Chem29:1305-8 (1987) Adenosine receptor A2a
Name:Adenosine receptor A2a
Type:Enzyme Catalytic Domain
Mol. Mass.:44955.08
Organism:GUINEA PIG
Description:ADENOSINE A2 0 GUINEA PIG::P46616
Residue:409
BDBM50025574
NameBDBM50025574
Synonyms:1,3-Diallyl-7-methyl-3,7-dihydro-purine-2,6-dione | CHEMBL26406
TypeSmall organic molecule
Emp. Form.C12H14N4O2
Mol. Mass.246.2652
SMILESCn1cnc2n(CC=C)c(=O)n(CC=C)c(=O)c12