Reaction Details
TargetAdenosine receptor A2a
LigandBDBM50025577
Substrate/Competitorn/a
Meas. Tech.ChEBML_27755
Ki 2800±n/a nM
Citation Daly, JWPadgett, WLShamim, MT Analogues of caffeine and theophylline: effect of structural alterations on affinity at adenosine receptors. J Med Chem29:1305-8 (1987) Adenosine receptor A2a
Name:Adenosine receptor A2a
Type:Enzyme Catalytic Domain
Mol. Mass.:44955.08
Organism:GUINEA PIG
Description:ADENOSINE A2 0 GUINEA PIG::P46616
Residue:409
BDBM50025577
NameBDBM50025577
Synonyms:3-Isobutyl-1-methyl-7-prop-2-ynyl-3,7-dihydro-purine-2,6-dione | CHEMBL24444
TypeSmall organic molecule
Emp. Form.C13H16N4O2
Mol. Mass.260.2917
SMILESCC(C)Cn1c2ncn(CC#C)c2c(=O)n(C)c1=O