Reaction Details
TargetAurora kinase A
LigandBDBM50175305
Substrate/Competitorn/a
Meas. Tech.ChEMBL_1794194 (CHEMBL4266311)
IC50 0.064000±n/a nM
Citation Borisa, ACBhatt, HG A comprehensive review on Aurora kinase: Small molecule inhibitors and clinical trial studies. Eur J Med Chem140:1-19 (2017) 
 
Aurora kinase A
Name:Aurora kinase A
Type:Serine/threonine-protein kinase
Mol. Mass.:45830.98
Organism:Homo sapiens (Human)
Description:O14965
Residue:403
BDBM50175305
NameBDBM50175305
Synonyms:CHEMBL3600873
TypeSmall organic molecule
Emp. Form.C22H21ClFN3O3S
Mol. Mass.461.937
SMILESOC(=O)[C@@]1(Cc2cccc(Nc3nccs3)n2)CC[C@@H](CC1)Oc1cccc(Cl)c1F