Reaction Details
TargetAdenosine receptor A1
LigandBDBM50025690
Substrate/Competitorn/a
Meas. Tech.ChEBML_29624
Ki 25±n/a nM
Citation Jacobson, KAUkena, DPadgett, WDaly, JWKirk, KL Xanthine functionalized congeners as potent ligands at A2-adenosine receptors. J Med Chem30:211-4 (1987) Adenosine receptor A1
Name:Adenosine receptor A1
Type:Protein
Mol. Mass.:36704.13
Organism:Rattus norvegicus (rat)
Description:n/a
Residue:326
BDBM50025690
NameBDBM50025690
Synonyms:CHEMBL17141 | N-{4-[(2-Amino-ethylcarbamoyl)-methyl]-phenyl}-2-[4-(1,3-diethyl-2,6-dioxo-2,3,6,7-tetrahydro-1H-purin-8-yl)-phenoxy]-acetamide
TypeSmall organic molecule
Emp. Form.C27H31N7O5
Mol. Mass.533.5789
SMILESCCn1c2nc([nH]c2c(=O)n(CC)c1=O)-c1ccc(OCC(=O)Nc2ccc(CC(=O)NCCN)cc2)cc1