Reaction Details
TargetChymotrypsin-like elastase family member 1/2A
LigandBDBM50225469
Substrate/Competitorn/a
Meas. Tech.ChEMBL_152334 (CHEMBL758716)
Ki 470000±n/a nM
Citation Groutas, WCAbrams, WRTheodorakis, MCKasper, AMRude, SABadger, RCOcain, TDMiller, KEMoi, MKBrubaker, MJ Amino acid derived latent isocyanates: irreversible inactivation of porcine pancreatic elastase and human leukocyte elastase. J Med Chem28:204-9 (1985) Chymotrypsin-like elastase family member 1/2A
Name:Chymotrypsin-like elastase family member 1/2A
Synonyms:Pancreatic elastase
Type:n/a
Mol. Mass.:n/a
Description:ASSAY_ID of ChEMBL is 152345
Components:This complex has 2 components.
Component 1
Name:Chymotrypsin-like elastase family member 1
Type:Enzyme
Mol. Mass.:28827.71
Organism:Sus scrofa (Pig)
Description:P00772
Residue:266
Component 2
Name:Chymotrypsin-like elastase family member 2A
Synonyms:CEL2A_PIG ELA2 Elastase 2A Elastase-2A | Pancreatic elastase
Type:PROTEIN
Mol. Mass.:28705.23
Organism:Sus scrofa
Description:ChEMBL_156951
Residue:269
BDBM50225469
NameBDBM50225469
Synonyms:CHEMBL302653
TypeSmall organic molecule
Emp. Form.C10H17N3O
Mol. Mass.195.2615
SMILESCCCCNC(=O)n1ccnc1CC