Reaction Details
TargetHeme oxygenase 1
LigandBDBM31663
Substrate/Competitorn/a
Meas. Tech.ChEMBL_1796598 (CHEMBL4268715)
IC50 2100±n/a nM
Citation Sorrenti, VPittalą, VRomeo, GAmata, EDichiara, MMarrazzo, ATurnaturi, RPrezzavento, OBarbagallo, IVanella, LRescifina, AFloresta, GTibullo, DDi Raimondo, FIntagliata, SSalerno, L Targeting heme Oxygenase-1 with hybrid compounds to overcome Imatinib resistance in chronic myeloid leukemia cell lines. Eur J Med Chem158:937-950 (2018) 
 
Heme oxygenase 1
Name:Heme oxygenase 1
Type:Enzyme
Mol. Mass.:33005.15
Organism:Rattus norvegicus (rat)
Description:HO-1 obtained from rat spleen was used in enzyme assays.
Residue:289
BDBM31663
NameBDBM31663
Synonyms:imidazole-dioxolane, 15
TypeSmall organic molecule
Emp. Form.C22H21ClF3N3O2S
Mol. Mass.483.934
SMILESFC(F)(F)c1ccc(SC[C@@H]2CO[C@@](CCc3ccc(Cl)cc3)(Cn3ccnc3)O2)nc1