Reaction Details
TargetPepsin A
LigandBDBM50025890
Substrate/Competitorn/a
Meas. Tech.ChEBML_154011
Ki 3.0±n/a nM
Citation Rich, DH Pepstatin-derived inhibitors of aspartic proteinases. A close look at an apparent transition-state analogue inhibitor. J Med Chem28:263-73 (1985) Pepsin A
Name:Pepsin A
Type:Enzyme
Mol. Mass.:41232.87
Organism:Porcine
Description:n/a
Residue:385
BDBM50025890
NameBDBM50025890
Synonyms:4-Hydroxy-2,7-dimethyl-5-[3-methyl-2-(3-methyl-butyrylamino)-butyrylamino]-octanoic acid (1-isobutylcarbamoyl-ethyl)-amide | CHEMBL315665
TypeSmall organic molecule
Emp. Form.C27H52N4O5
Mol. Mass.512.7256
SMILESCC(C)CNC(=O)[C@H](C)NC(=O)[C@@H](C)CC(O)[C@@H](CC(C)C)NC(=O)[C@H](NC(=O)CC(C)C)C(C)C