Reaction Details
TargetDipeptidyl peptidase 1
LigandBDBM50026027
Substrate/Competitorn/a
Meas. Tech.ChEMBL_53204 (CHEMBL666583)
Ki 6200000±n/a nM
Citation Thompson, SAAndrews, PRHanzlik, RP Carboxyl-modified amino acids and peptides as protease inhibitors. J Med Chem29:104-11 (1986) Dipeptidyl peptidase 1
Name:Dipeptidyl peptidase 1
Type:Enzyme
Mol. Mass.:51857.28
Organism:Homo sapiens (Human)
Description:P53634
Residue:463
BDBM50026027
NameBDBM50026027
Synonyms:2-(2-Amino-acetylamino)-3-phenyl-propionamide Gly-Phe-NH2
TypeSmall organic molecule
Emp. Form.C11H15N3O2
Mol. Mass.221.2557
SMILESNCC(=O)N[C@@H](Cc1ccccc1)C(N)=O