Reaction Details
TargetHigh affinity choline transporter 1
LigandBDBM50026219
Substrate/Competitorn/a
Meas. Tech.ChEBML_49275
IC50 7500±n/a nM
Citation Mistry, JSAbraham, DJHanin, I Neurochemistry of aging. 1. Toxins for an animal model of Alzheimer's disease. J Med Chem29:376-80 (1986) High affinity choline transporter 1
Name:High affinity choline transporter 1
Type:PROTEIN
Mol. Mass.:63358.06
Organism:Mus musculus
Description:ChEMBL_644789
Residue:580
BDBM50026219
NameBDBM50026219
Synonyms:1-(2-Hydroxy-ethyl)-1-propyl-aziridinium; chloride | CHEMBL125710
TypeSmall organic molecule
Emp. Form.C7H16NO
Mol. Mass.130.2075
SMILESCCC[N+]1(CCO)CC1