Reaction Details
TargetVascular endothelial growth factor receptor 1
LigandBDBM25117
Substrate/Competitorn/a
Meas. Tech.ChEMBL_1799021 (CHEMBL4271313)
IC50 0.100000±n/a nM
Citation Song, M Recent developments in small molecule therapies for renal cell carcinoma. Eur J Med Chem142:383-392 (2017) 
 
Vascular endothelial growth factor receptor 1
Name:Vascular endothelial growth factor receptor 1
Type:Receptor Tyrosine Kinase
Mol. Mass.:150800.23
Organism:Homo sapiens (Human)
Description:P17948
Residue:1338
BDBM25117
NameBDBM25117
Synonyms:AG-013736 N-methyl-2-({3-[(E)-2-(pyridin-2-yl)ethenyl]-1H-indazol-6-yl}sulfanyl)benzamide US9205078, Axitinib | US9617222, Compound A
TypeSmall organic molecule
Emp. Form.C22H18N4OS
Mol. Mass.386.47
SMILESCNC(=O)c1ccccc1Sc1ccc2c(\C=C\c3ccccn3)n[nH]c2c1