Reaction Details
TargetATP-citrate synthase
LigandBDBM50066683
Substrate/Competitorn/a
Meas. Tech.ChEMBL_1803487 (CHEMBL4275779)
Ki 1000±n/a nM
Citation Granchi, C ATP citrate lyase (ACLY) inhibitors: An anti-cancer strategy at the crossroads of glucose and lipid metabolism. Eur J Med Chem157:1276-1291 (2018) 
 
ATP-citrate synthase
Name:ATP-citrate synthase
Type:PROTEIN
Mol. Mass.:120848.43
Organism:Homo sapiens (Human)
Description:ChEMBL_455196
Residue:1101
BDBM50066683
NameBDBM50066683
Synonyms:(S)-2-((R)-8-(2,4-dichlorophenyl)-2-hydroxyoctyl)-2-hydroxysuccinic acid CHEMBL119628
TypeSmall organic molecule
Emp. Form.C18H24Cl2O6
Mol. Mass.407.286
SMILESO[C@H](CCCCCCc1ccc(Cl)cc1Cl)C[C@](O)(CC(O)=O)C(O)=O