Reaction Details
TargetATP-citrate synthase
LigandBDBM50394678
Substrate/Competitorn/a
Meas. Tech.ChEMBL_1803477 (CHEMBL4275769)
Ki 3200±n/a nM
Citation Granchi, C ATP citrate lyase (ACLY) inhibitors: An anti-cancer strategy at the crossroads of glucose and lipid metabolism. Eur J Med Chem157:1276-1291 (2018) 
 
ATP-citrate synthase
Name:ATP-citrate synthase
Type:PROTEIN
Mol. Mass.:120848.43
Organism:Homo sapiens (Human)
Description:ChEMBL_455196
Residue:1101
BDBM50394678
NameBDBM50394678
Synonyms:CHEMBL2165261
TypeSmall organic molecule
Emp. Form.C6H6F2O7
Mol. Mass.228.1044
SMILESOC(=O)C[C@](O)(C(O)=O)C(F)(F)C(O)=O