Reaction Details
TargetATP-citrate synthase
LigandBDBM50066694
Substrate/Competitorn/a
Meas. Tech.ChEMBL_1803487 (CHEMBL4275779)
Ki 220±n/a nM
Citation Granchi, C ATP citrate lyase (ACLY) inhibitors: An anti-cancer strategy at the crossroads of glucose and lipid metabolism. Eur J Med Chem157:1276-1291 (2018) 
 
ATP-citrate synthase
Name:ATP-citrate synthase
Type:PROTEIN
Mol. Mass.:120848.43
Organism:Homo sapiens (Human)
Description:ChEMBL_455196
Residue:1101
BDBM50066694
NameBDBM50066694
Synonyms:(S)-2-[(R)-7-(3-Chloro-9H-fluoren-9-yl)-2-hydroxy-heptyl]-2-hydroxy-succinic acid | CHEMBL120302
TypeSmall organic molecule
Emp. Form.C24H27ClO6
Mol. Mass.446.921
SMILESO[C@H](CCCCCC1c2ccccc2-c2cc(Cl)ccc12)C[C@](O)(CC(O)=O)C(O)=O