Reaction Details
TargetBeta-galactosidase
LigandBDBM50469237
Substrate/Competitorn/a
Meas. Tech.ChEMBL_1803731 (CHEMBL4276023)
IC50 250±n/a nM
Citation Front, SAlmeida, SZoete, VCharollais-Thoenig, JGallienne, EMarmy, CPilloud, VMarti, RWood, TMartin, ORDemotz, S 4-epi-Isofagomine derivatives as pharmacological chaperones for the treatment of lysosomal diseases linked to ?-galactosidase mutations: Improved synthesis and biological investigations. Bioorg Med Chem26:5462-5469 (2018) 
 
Beta-galactosidase
Name:Beta-galactosidase
Type:PROTEIN
Mol. Mass.:76074.43
Organism:Homo sapiens (Human)
Description:ChEMBL_215886
Residue:677
BDBM50469237
NameBDBM50469237
Synonyms:CHEMBL4281031
TypeSmall organic molecule
Emp. Form.C7H15NO3
Mol. Mass.161.1989
SMILESC[C@H]1NC[C@@H](O)[C@@H](O)[C@H]1CO