Reaction Details
TargetBeta-galactosidase
LigandBDBM50469238
Substrate/Competitorn/a
Meas. Tech.ChEMBL_1803731 (CHEMBL4276023)
IC50 0.400000±n/a nM
Citation Front, SAlmeida, SZoete, VCharollais-Thoenig, JGallienne, EMarmy, CPilloud, VMarti, RWood, TMartin, ORDemotz, S 4-epi-Isofagomine derivatives as pharmacological chaperones for the treatment of lysosomal diseases linked to ?-galactosidase mutations: Improved synthesis and biological investigations. Bioorg Med Chem26:5462-5469 (2018) 
 
Beta-galactosidase
Name:Beta-galactosidase
Type:PROTEIN
Mol. Mass.:76074.43
Organism:Homo sapiens (Human)
Description:ChEMBL_215886
Residue:677
BDBM50469238
NameBDBM50469238
Synonyms:CHEMBL4288931
TypeSmall organic molecule
Emp. Form.C15H31NO3
Mol. Mass.273.4115
SMILESCCCCCCCCC[C@H]1NC[C@@H](O)[C@@H](O)[C@H]1CO