Reaction Details
TargetQuinolone resistance protein NorA
LigandBDBM50101815
Substrate/Competitorn/a
Meas. Tech.ChEMBL_1692500 (CHEMBL4043390)
IC50 22800±n/a nM
Citation Astolfi, AFelicetti, TIraci, NManfroni, GMassari, SPietrella, DTabarrini, OKaatz, GWBarreca, MLSabatini, SCecchetti, V Pharmacophore-Based Repositioning of Approved Drugs as Novel Staphylococcus aureus NorA Efflux Pump Inhibitors. J Med Chem60:1598-1604 (2017) 
 
Quinolone resistance protein NorA
Name:Quinolone resistance protein NorA
Type:PROTEIN
Mol. Mass.:42273.03
Organism:Staphylococcus aureus
Description:ChEMBL_961221
Residue:388
BDBM50101815
NameBDBM50101815
Synonyms:CHEBI:7550 | Nicardipine
TypeSmall organic molecule
Emp. Form.C26H29N3O6
Mol. Mass.479.525
SMILESCOC(=O)C1=C(C)NC(C)=C(C1c1cccc(c1)[N+]([O-])=O)C(=O)OCCN(C)Cc1ccccc1