Reaction Details
TargetCholine O-acetyltransferase
LigandBDBM50026468
Substrate/Competitorn/a
Meas. Tech.ChEMBL_27377 (CHEMBL642410)
Ki 7200000±n/a nM
Citation Cohen, SGChishti, SBElkind, JLReese, HCohen, JB Effects of charge, volume, and surface on binding of inhibitor and substrate moieties to acetylcholinesterase. J Med Chem28:1309-13 (1985) Choline O-acetyltransferase
Name:Choline O-acetyltransferase
Type:Enzyme Catalytic Domain
Mol. Mass.:71875.58
Organism:RAT
Description:Choline Acetyltransferase 0 RAT::P32738
Residue:640
BDBM50026468
NameBDBM50026468
Synonyms:CHEMBL25340 | Trimethyl-sulfonium; iodide
TypeSmall organic molecule
Emp. Form.C3H9S
Mol. Mass.77.168
SMILESC[S+](C)C