Reaction Details
TargetCholine O-acetyltransferase
LigandBDBM36173
Substrate/Competitorn/a
Meas. Tech.ChEMBL_27375 (CHEMBL642521)
Ki 47000000±n/a nM
Citation Cohen, SGChishti, SBElkind, JLReese, HCohen, JB Effects of charge, volume, and surface on binding of inhibitor and substrate moieties to acetylcholinesterase. J Med Chem28:1309-13 (1985) Choline O-acetyltransferase
Name:Choline O-acetyltransferase
Type:Enzyme Catalytic Domain
Mol. Mass.:71875.58
Organism:RAT
Description:Choline Acetyltransferase 0 RAT::P32738
Residue:640
BDBM36173
NameBDBM36173
Synonyms:1-butanol CHEMBL14245
TypeGuest
Emp. Form.C4H10O
Mol. Mass.74.1216
SMILESCCCCO