Reaction Details
Target5-hydroxytryptamine receptor 1A
LigandBDBM50007179
Substrate/Competitorn/a
Meas. Tech.ChEMBL_1512 (CHEMBL616344)
Ki 4.0±n/a nM
Citation Gaillard, PCarrupt, PATesta, BSchambel, P Binding of arylpiperazines, (aryloxy)propanolamines, and tetrahydropyridylindoles to the 5-HT1A receptor: contribution of the molecular lipophilicity potential to three-dimensional quantitative structure-affinity relationship models. J Med Chem39:126-34 (1996) 
 
5-hydroxytryptamine receptor 1A
Name:5-hydroxytryptamine receptor 1A
Type:G Protein-Coupled Receptor (GPCR)
Mol. Mass.:46445.29
Organism:Rattus norvegicus (rat)
Description:Binding assays were performed using rat hippocampal membranes.
Residue:422
BDBM50007179
NameBDBM50007179
Synonyms:4-Iodo-N-{4-[4-(2-methoxy-phenyl)-piperazin-1-yl]-butyl}-benzamide | CHEMBL27254
TypeSmall organic molecule
Emp. Form.C22H28IN3O2
Mol. Mass.493.3811
SMILESCOc1ccccc1N1CCN(CCCCNC(=O)c2ccc(I)cc2)CC1