Reaction Details
TargetBeta-2 adrenergic receptor
LigandBDBM50470923
Substrate/Competitorn/a
Meas. Tech.ChEMBL_38477 (CHEMBL650854)
Ki 0.301995±n/a nM
Citation De Los Angeles, JENikulin, VIShams, GKonkar, AAMehta, RFeller, DRMiller, DD Iodinated analogs of trimetoquinol as highly potent and selective beta 2-adrenoceptor ligands. J Med Chem39:3701-11 (1996) 
 
Beta-2 adrenergic receptor
Name:Beta-2 adrenergic receptor
Type:n/a
Mol. Mass.:46461.69
Organism:Homo sapiens (Human)
Description:P07550
Residue:413
BDBM50470923
NameBDBM50470923
Synonyms:CHEMBL122757
TypeSmall organic molecule
Emp. Form.C16H15I2NO2
Mol. Mass.507.1047
SMILESOc1cc2CCNC(Cc3cc(I)cc(I)c3)c2cc1O