Reaction Details
TargetAlpha-1D adrenergic receptor
LigandBDBM50118703
Substrate/Competitorn/a
Meas. Tech.ChEMBL_32868 (CHEMBL859455)
Ki 1349±n/a nM
Citation Meyer, MDAltenbach, RJHancock, AABuckner, SAKnepper, SMKerwin, JF Synthesis and in vitro characterization of N-[5-(4,5-dihydro-1H-imidazol-2-yl)-2-hydroxy-5,6,7,8- tetrahydronaphthalen-1-yl]methanesulfonamide and its enantiomers: a novel selective alpha 1A receptor agonist. J Med Chem39:4116-9 (1996) 
 
Alpha-1D adrenergic receptor
Name:Alpha-1D adrenergic receptor
Type:Protein
Mol. Mass.:59375.97
Organism:Rattus norvegicus (Rat)
Description:P23944
Residue:561
BDBM50118703
NameBDBM50118703
Synonyms:CHEMBL109783 | N-[5-(4,5-Dihydro-1H-imidazol-2-yl)-2-hydroxy-5,6,7,8-tetrahydro-naphthalen-1-yl]-methanesulfonamide
TypeSmall organic molecule
Emp. Form.C14H19N3O3S
Mol. Mass.309.384
SMILESCS(=O)(=O)Nc1c(O)ccc2C(CCCc12)C1=NCCN1