Reaction Details
TargetAlpha-1B adrenergic receptor
LigandBDBM50118703
Substrate/Competitorn/a
Meas. Tech.ChEMBL_34315 (CHEMBL859457)
Ki 2089±n/a nM
Citation Meyer, MDAltenbach, RJHancock, AABuckner, SAKnepper, SMKerwin, JF Synthesis and in vitro characterization of N-[5-(4,5-dihydro-1H-imidazol-2-yl)-2-hydroxy-5,6,7,8- tetrahydronaphthalen-1-yl]methanesulfonamide and its enantiomers: a novel selective alpha 1A receptor agonist. J Med Chem39:4116-9 (1996) 
 
Alpha-1B adrenergic receptor
Name:Alpha-1B adrenergic receptor
Type:Enzyme Catalytic Domain
Mol. Mass.:56514.13
Organism:HAMSTER
Description:adrenergic Alpha1 0 HAMSTER::P18841
Residue:515
BDBM50118703
NameBDBM50118703
Synonyms:CHEMBL109783 | N-[5-(4,5-Dihydro-1H-imidazol-2-yl)-2-hydroxy-5,6,7,8-tetrahydro-naphthalen-1-yl]-methanesulfonamide
TypeSmall organic molecule
Emp. Form.C14H19N3O3S
Mol. Mass.309.384
SMILESCS(=O)(=O)Nc1c(O)ccc2C(CCCc12)C1=NCCN1