Reaction Details
TargetAlpha-1B adrenergic receptor
LigandBDBM50067212
Substrate/Competitorn/a
Meas. Tech.ChEMBL_32289 (CHEMBL646236)
EC50 10965±n/a nM
Citation Meyer, MDAltenbach, RJHancock, AABuckner, SAKnepper, SMKerwin, JF Synthesis and in vitro characterization of N-[5-(4,5-dihydro-1H-imidazol-2-yl)-2-hydroxy-5,6,7,8- tetrahydronaphthalen-1-yl]methanesulfonamide and its enantiomers: a novel selective alpha 1A receptor agonist. J Med Chem39:4116-9 (1996) 
 
Alpha-1B adrenergic receptor
Name:Alpha-1B adrenergic receptor
Type:G Protein-Coupled Receptor (GPCR)
Mol. Mass.:56606.71
Organism:Rattus norvegicus (rat)
Description:Receptor binding assays were performed using rat cortical membranes.
Residue:515
BDBM50067212
NameBDBM50067212
Synonyms:CHEBI:8093 Duo-Medihaler | Phenylephrine
TypeSmall organic molecule
Emp. Form.C9H13NO2
Mol. Mass.167.205
SMILESCNC[C@H](O)c1cccc(O)c1