Reaction Details
TargetSimilar to alpha-tubulin isoform 1
LigandBDBM50012278
Substrate/Competitorn/a
Meas. Tech.ChEMBL_211328 (CHEMBL818987)
IC50 700±n/a nM
Citation Goldbrunner, MLoidl, GPolossek, TMannschreck, Avon Angerer, E Inhibition of tubulin polymerization by 5,6-dihydroindolo[2,1-alpha]isoquinoline derivatives. J Med Chem40:3524-33 (1997) 
 
Similar to alpha-tubulin isoform 1
Name:Similar to alpha-tubulin isoform 1
Synonyms:Similar to alpha-tubulin isoform 1
Type:PROTEIN
Mol. Mass.:10383.05
Organism:Bos taurus
Description:ChEMBL_104716
Residue:99
BDBM50012278
NameBDBM50012278
TypeSmall organic molecule
Emp. Form.C46H58N4O9
Mol. Mass.810.9741
SMILESCC[C@]1(O)C[C@@H]2CN(C1)CCc1c([nH]c3ccccc13)[C@@](C2)(C(=O)OC)c1cc2c(cc1OC)N(C)[C@@H]1[C@]22CCN3CC=C[C@](CC)([C@@H]23)[C@@H](OC(C)=O)[C@]1(O)C(=O)OC