Reaction Details
TargetSimilar to alpha-tubulin isoform 1
LigandBDBM50139772
Substrate/Competitorn/a
Meas. Tech.ChEMBL_211324 (CHEMBL818983)
IC50 1800±n/a nM
Citation Poncet, JBusquet, MRoux, FPierré, AAtassi, GJouin, P Synthesis and biological activity of chimeric structures derived from the cytotoxic natural compounds dolastatin 10 and dolastatin 15. J Med Chem41:1524-30 (1998) 
 
Similar to alpha-tubulin isoform 1
Name:Similar to alpha-tubulin isoform 1
Synonyms:Similar to alpha-tubulin isoform 1
Type:PROTEIN
Mol. Mass.:10383.05
Organism:Bos taurus
Description:ChEMBL_104716
Residue:99
BDBM50139772
NameBDBM50139772
TypeSmall organic molecule
Emp. Form.C46H56N4O10
Mol. Mass.824.9576
SMILESCC[C@]1(O)C[C@H]2CN(C1)CCc1c([nH]c3ccccc13)[C@@](C2)(C(=O)OC)c1cc2c(cc1OC)N(C=O)[C@@H]1[C@]22CCN3CC=C[C@](CC)([C@@H]23)[C@@H](OC(C)=O)[C@]1(O)C(=O)OC