Reaction Details
TargetAlpha-2A adrenergic receptor
LigandBDBM50027023
Substrate/Competitorn/a
Meas. Tech.ChEBML_33031
Ki 42±n/a nM
Citation Saari, WSHalczenko, WKing, SWHuff, JRGuare, JPHunt, CARandall, WCAnderson, PSLotti, VJTaylor, DA Pyridinylpiperazines, a new class of selective alpha 2-adrenoceptor antagonists. J Med Chem26:1696-701 (1984) Alpha-2A adrenergic receptor
Name:Alpha-2A adrenergic receptor
Type:Enzyme Catalytic Domain
Mol. Mass.:49275.13
Organism:BOVINE
Description:adrenergic Alpha2 0 BOVINE::Q28838
Residue:452
BDBM50027023
NameBDBM50027023
Synonyms:1-(3-Iodo-pyridin-2-yl)-piperazine | CHEMBL295764
TypeSmall organic molecule
Emp. Form.C9H12IN3
Mol. Mass.289.1162
SMILESIc1cccnc1N1CCNCC1